Mierlo-Hout
type: Thing
type: Concept
main entity of page: https://data.bibliotheken.nl/.well-known/genid/bd3b70328838d7161d48c391cca71fda
broader: p075632845
in scheme: brinkman
related: p41618877X
scope note: Mierlo-Hout was een dorp in de voormalige Nederlandse gemeente Mierlo. Vanwege uitbreiding van Helmond is het in 1968, via een grenscorrectie, een stadsdeel van Helmond geworden onder de naam Helmond-'t Hout. Sinds 2006 is de naam Mierlo-Hout als stadsdeel weer terug, nadat de inwoners hiervoor ludieke acties op touw hadden gezet.