Germania superior
type: Concept
main entity of page: http://data.bibliotheken.nl/doc/thes/p264807928
main entity of page: https://koninklijkebibliotheek.triply.cc/.well-known/genid/f1b95dca6363c419db4c8d32e80f298d
broader: p078958490
editorial note: GOO-thesaurusbeheer
editorial note: WP9
in scheme: gtt
scope note: Romeinse provincie, delen van West-Duitsland en Noordoost-Frankrijk