Opiumoorlogen
type: Concept
main entity of page: http://data.bibliotheken.nl/doc/thes/p241775027
main entity of page: https://koninklijkebibliotheek.triply.cc/.well-known/genid/75c62dfe0175b2cf8f7a72b19697f253
broader: p078613124
editorial note: GOO-thesaurusbeheer
editorial note: WP9; Encyclopaedia Britannica
in scheme: gtt
preferred label: Opium Wars @en
scope note: Oorlogen die westerse mogendheden tegen China hebben gevoerd om handelsprivileges te verkrijgen (1839-1842; 1856-1860)