Scaliger Instituut (Leiden)
type: Concept
main entity of page: http://data.bibliotheken.nl/doc/thes/p241157196
main entity of page: https://koninklijkebibliotheek.triply.cc/.well-known/genid/2d2544cf4efb69202113d5cbd005ade0
editorial note: GOO-thesaurusbeheer
editorial note: Website Universiteitsbibliotheek te Leiden
in scheme: gtt
preferred label: Scaliger Institute (Leiden) @en
scope note: Institute at Leiden University to serve a.o. as an intermediary between the Special Collections of the University and their users