Onrust (eiland)
type: Thing
type: Concept
main entity of page: https://data.bibliotheken.nl/.well-known/genid/8b857f972711058c67d0009ab72694c5
alternative label: Pulau Onrust
alternative label: Pulau Kapal
broader: p075631245
in scheme: brinkman
scope note: Pulau Onrust (ook Poeloe kapal of Scheepseiland) is een Indonesisch eiland voor de kust van Jakarta, met een oppervlak van 3.500 vierkante meter.