Vleuterweide (Utrecht (stad))
type: Thing
type: Concept
main entity of page: https://data.bibliotheken.nl/.well-known/genid/89f20f5064e1be463d61570b0f1d36fd
broader: p075633930
in scheme: brinkman
scope note: plangebied, VINEX-locatie ten zuiden van Vleuten