Gerwen
type: Thing
type: Concept
main entity of page: https://data.bibliotheken.nl/.well-known/genid/bf79ba16d6c7738d70b54086995e6ade
broader: p075632845
in scheme: brinkman
related: p343205858
scope note: dorp in de gemeente Nuenen, Gerwen en Nederwetten