Zwarte Water
type: Thing
type: Concept
main entity of page: https://data.bibliotheken.nl/.well-known/genid/13928210fc6b7e2e9dc568e0a7b4250e
broader: p075633159
in scheme: brinkman
scope note: Zwarte Water (rivier), een rivier in Overijssel