Lahore
type: Thing
type: Concept
main entity of page: https://data.bibliotheken.nl/.well-known/genid/479bdcf6744106bc1a0ece4843fd1132
broader: p075633175
in scheme: brinkman
scope note: Lahore (Punjabi: ਲਾਹੌਰ, Lāhaur, Urdu: لاور) is de tweede stad van Pakistan