Henna
type: Concept
main entity of page: http://data.bibliotheken.nl/doc/thes/p184637511
main entity of page: https://koninklijkebibliotheek.triply.cc/.well-known/genid/fc47fa2bc6a715dad0ae84a919a6e22a
alternative label: Alkanna
editorial note: WP9
editorial note: GOO-thesaurusbeheer
in scheme: gtt
scope note: Verfstof, onttrokken aan planten uit de plantenfamilie Alkanna