Eudemonisme
type: Concept
main entity of page: http://data.bibliotheken.nl/doc/thes/p183186885
main entity of page: https://koninklijkebibliotheek.triply.cc/.well-known/genid/1f7c5161ceaf391ce6bbc5d29aa69df7
alternative label: Eudaemonism @en
editorial note: GOO-thesaurusbeheer
editorial note: Right actions and good persons : controversies between eudaimonistic and deontic moral theories / Marjaana Kopperi /+/ echter spelling kmc 161 en 261 volgens Concise Oxford dictionary
editorial note: WP9, zie onder: eudemonisme
in scheme: gtt
preferred label: Eudemonism @en
scope note: De leer waarbij het zoeken van geluk het doel van alle handelen is