Watergeuzen
type: Concept
editorial note: WP9; Nijhoffs geschiedenislexicon, zie onder: Geuzen
editorial note: GOO-thesaurusbeheer
editorial note: Niet verwarren met de verzetsgroep uit WO II: de Geuzen
main entity of page: https://koninklijkebibliotheek.triply.cc/.well-known/genid/a5af8a57537bbbc2ff01485cc29a91d5
main entity of page: http://data.bibliotheken.nl/doc/thes/p183100514
in scheme: gtt
preferred label: Sea beggars @en
scope note: Militaire groepering tijdens de Tachtigjarige Oorlog