Ballymenone
type: Concept
main entity of page: http://data.bibliotheken.nl/doc/thes/p172039363
main entity of page: https://koninklijkebibliotheek.triply.cc/.well-known/genid/c06517e84c73bcb5924528d97acfb0a2
broader: p078527112
editorial note: GOO-thesaurusbeheer
editorial note: Passing the time in Ballymenone / H. Glassie
in scheme: gtt
scope note: Kleine plaats in de County Fermanagh, Noord-Ierland