Hoechst
type: Concept
main entity of page: http://data.bibliotheken.nl/doc/thes/p171717295
main entity of page: https://koninklijkebibliotheek.triply.cc/.well-known/genid/639966a1be8c80aae10543f26dab1088
editorial note: WP8
editorial note: GOO-thesaurusbeheer
in scheme: gtt
scope note: Chemieconcern voortgekomen uit de opdeling van IG Farben