Kerala
type: Thing
type: Concept
main entity of page: https://data.bibliotheken.nl/.well-known/genid/8e92ec8aba69fbadda856343008b8794
broader: p075631210
in scheme: brinkman
scope note: Kerala (Malayalam: കേരളം) is een deelstaat in het uiterste zuidwesten van India.