Vermogensbeheer
type: Concept
main entity of page: https://koninklijkebibliotheek.triply.cc/.well-known/genid/d1c11c5e1b2e8d27cf2b453417f9fef2
main entity of page: http://data.bibliotheken.nl/doc/thes/p161230032
editorial note: Financieel management begrippenlijst / Th. van Beek, 1995
editorial note: GOO-thesaurusbeheer/-PV
in scheme: gtt
preferred label: Asset management @en
related: p078941695
scope note: Betreft het beheer van een effecten- en/of onroerend goedportefeuille