Nedersaksisch
type: Concept
main entity of page: http://data.bibliotheken.nl/doc/thes/p16001915X
main entity of page: https://koninklijkebibliotheek.triply.cc/.well-known/genid/8a3510f15ab30cfcb3ede855e536c51e
alternative label: Niedersächsisch
broader: p095994394
editorial note: Ethnologue
editorial note: MK
editorial note: VD12
in scheme: gtt
preferred label: Low Saxon @en
scope note: Dit dialect wordt gesproken in Noordoost-Nederland en in Nedersaksen (BRD)