Maasvlakte
type: Thing
type: Concept
main entity of page: https://data.bibliotheken.nl/.well-known/genid/235858119a24fac775d90017997cfd20
broader: p075633485
in scheme: brinkman
related: p327767545
scope note: Wikipedia: De Maasvlakte is een groot industriegebied dat aangelegd is in de Noordzee. De Maasvlakte maakt deel uit van de Rotterdamse haven, en hoort tot de gemeente Rotterdam, alhoewel de stad Rotterdam ruim 40 kilometer verderop ligt.