Depletie
type: Concept
main entity of page: http://data.bibliotheken.nl/doc/thes/p154077453
main entity of page: https://koninklijkebibliotheek.triply.cc/.well-known/genid/a9e95cea53f9e35bef26a5666439fda7
editorial note: Er zijn verschillende depletievormen: door ondervoeding, door ziekte of door "puntvormige" depletie (tekort aan 1 essentieel voedingsbestanddeel)
editorial note: GOO-thesaurusbeheer
editorial note: Grote Nederlandse Larousse encyclopedie : VD12
editorial note: Klinische depletie bij kinderen : bepaling en voedingstherapie / Nutricia
in scheme: gtt
preferred label: Depletion @en
related: p078610036
scope note: Verlies van een in een lichaam aanwezige stof