Sumba
type: Thing
type: Concept
main entity of page: https://data.bibliotheken.nl/.well-known/genid/95ffdc38af1f69f57ec54d3d3c4531a7
alternative label: Sandelhouteiland
alternative label: Soemba
broader: p075631245
in scheme: brinkman
scope note: Het droge en bergachtige eiland Soemba of Sumba (vroeger door de Nederlanders Sandelhouteiland genoemd), behoort tot de Kleine Soenda-eilanden van Indonesië