Meierij van 's-Hertogenbosch
type: Thing
type: Concept
main entity of page: https://data.bibliotheken.nl/.well-known/genid/8e19d032b7b7b60fdd77e2d480608647
alternative label: Meierij van Den Bosch
alternative label: Meijerij van Den Bosch
broader: p075632845
in scheme: brinkman
scope note: Ook kortweg: "Meierij"
scope note: "... De Meierij van 's-Hertogenbosch was één van de vier delen van het Hertogdom Brabant. Nu wordt de naam gebruikt ter aanduiding van een landstreek in Noord-Brabant ..."