Kniphorstbos
type: Thing
type: Concept
main entity of page: https://data.bibliotheken.nl/.well-known/genid/e48af1786ec426af5a796bc25dee3a8f
broader: p075639998
in scheme: brinkman
scope note: De Strubben-Kniphorstbos is een natuurgebied van 377 hectare, gelegen tussen Anloo en Schipborg in de Nederlandse provincie Drenthe