Lancelot-cyclus (anoniem)
type: Concept
main entity of page: http://data.bibliotheken.nl/doc/thes/p147817277
main entity of page: https://koninklijkebibliotheek.triply.cc/.well-known/genid/c5cbfda2955f03a80c0457674464ce6c
alternative label: Cycle de la Vulgate (anoniem)
alternative label: Lancelot-Graal (anoniem)
editorial note: Dictionaire des Littératures de langue Franc̜aise
editorial note: PV
in scheme: gtt
preferred label: Lancelot-cyclus (anonymous) @en
scope note: Cyclus uit de 13e eeuw van 5 anonieme werken over Lancelot, de graalqueeste, en de ondergang van de Arthurwereld. Een van de delen is de 'Lancelot du Lac' of 'Lancelot propre'