Beauraing
type: Thing
type: Concept
main entity of page: https://data.bibliotheken.nl/.well-known/genid/19ccc6b8b9a1b88ac8a384576b076d02
broader: p075629720
in scheme: brinkman
scope note: Beauraing is een kleine stad in de Belgische provincie Namen