Georgië
type: Thing
type: Concept
main entity of page: https://data.bibliotheken.nl/.well-known/genid/f8f81dfec82042e52ef0f80d9b31fb4f
in scheme: brinkman
scope note: Georgië (Georgisch: საქართველო, Sakartvelo) is een land dat geografisch gezien vrijwel geheel in Zuidwest-Azië ligt en voor een zeer klein deel ook in Europa