Dodenofficie
type: Concept
editorial note: VD11 : GNLE : KE2
editorial note: GOO-thesaurusbeheer
main entity of page: http://data.bibliotheken.nl/doc/thes/p138348006
main entity of page: https://koninklijkebibliotheek.triply.cc/.well-known/genid/c049078d3195115618468d19ec389a04
alternative label: Uitvaartdienst
broader: p078576865
in scheme: gtt
scope note: Rooms-katholieke liturgie bij sterfgevallen