Oudgotlands
type: Concept
main entity of page: https://koninklijkebibliotheek.triply.cc/.well-known/genid/3168ad601f90446be0b21a16ec8e4f13
main entity of page: http://data.bibliotheken.nl/doc/thes/p134549481
preferred label: Forngutniska
broader: p078657652
editorial note: Nationalencyclopedin, zie onder: Gotland; of: De nordiska språken / Wessén
editorial note: GOO-thesaurusbeheer
editorial note: De taal van Gotland 9XX-15XX. NIET voor het moderne Zweedse dialect (gutamål, gutniska, gotländska) van Gotland!
in scheme: gtt
scope note: De taal van Gotland 9XX-15XX. Gebruik voor het moderne Zweedse dialect van Gotland (gutamål, gutniska, gotländska) de trefwoorden Zweeds, dialecten, Gotland.