Tarn
type: Thing
type: Concept
main entity of page: https://data.bibliotheken.nl/.well-known/genid/57690fa1d00c5e9d189abc1a7cabed8f
broader: p07563080X
in scheme: brinkman
scope note: Tarn (81) is een Frans departement, gelegen in de regio Midi-Pyrénées. Het departement is genoemd naar de gelijknamige rivier.