Kerkelijkheid
type: Concept
main entity of page: http://data.bibliotheken.nl/doc/thes/p125755465
main entity of page: https://koninklijkebibliotheek.triply.cc/.well-known/genid/1f3d7faae4bc4a70ec11b39ab2408e00
editorial note: GOO-thesaurusbeheer
editorial note: VD12
in scheme: gtt
preferred label: Piety @en
scope note: 1) Het zich gedragen naar de regels of gebruiken der kerk. 2) Gezindheid tot, genegenheid voor de kerk