Gelderse Vallei
type: Thing
type: Concept
main entity of page: https://data.bibliotheken.nl/.well-known/genid/0ea0678ded3e03f3bb7cd826b0f22d78
in scheme: brinkman
scope note: De Gelderse Vallei is een streek gelegen in Midden-Nederland. Het gebied ligt ruwweg tussen de Utrechtse Heuvelrug in het westen, een stukje Nederrijn in het zuiden, de Veluwe in het oosten en de Randmeren in het noorden. De Gelderse Vallei ligt voor twee derde in de provincie Gelderland en voor een derde in de provincie Utrecht