Apostolische Stoel
type: Concept
main entity of page: http://data.bibliotheken.nl/doc/thes/p115646329
main entity of page: https://koninklijkebibliotheek.triply.cc/.well-known/genid/fec46e6283831ae03ac1ba88d0049b05
alternative label: Holy See @en
alternative label: Vaticaan (bestuursinstelling)
alternative label: Sedes Apostolica
alternative label: Heilige Stoel
alternative label: Sancta Sedes
editorial note: WP9
editorial note: SS
in scheme: gtt
preferred label: Apostolic See @en
scope note: Voor Vaticaan als wereldlijke staat zie: Vaticaanstad en/of Kerkelijke Staat