Jakobieten (religie)
type: Concept
main entity of page: http://data.bibliotheken.nl/doc/thes/p114136955
main entity of page: https://koninklijkebibliotheek.triply.cc/.well-known/genid/a1782d7befbfcdc6751ee2f69f25dfdd
alternative label: Jacobieten (religie)
broader: p078595045
editorial note: WP9
editorial note: SS/GdlH/-PV
in scheme: gtt
preferred label: Jacobites (religion) @en
scope note: Benaming voor de monofysieten in Syrië en Noord-Mesopotamië