Eemmeer
type: Thing
type: Concept
main entity of page: https://data.bibliotheken.nl/.well-known/genid/51a6b103d500e12add6615cf06644f3d
broader: p075632705
in scheme: brinkman
scope note: Het Eemmeer is een randmeer tussen de Nederlandse provincies Utrecht, Flevoland en Noord-Holland