Metaalkunde
type: Concept
main entity of page: https://koninklijkebibliotheek.triply.cc/.well-known/genid/9d5d2345672a51d736c845c8950dbe5c
main entity of page: http://data.bibliotheken.nl/doc/thes/p113086628
editorial note: _PV
editorial note: WP9 (onder Metallurgie)
editorial note: Het Engelse begrip Metallurgy is meeromvattend dan het Nederlandse metallurgie
in scheme: gtt
preferred label: Metallurgy @en
related: p078589142
scope note: Wetenschap van fysische/chemische eigenschappen van metalen