Dagvaarten
type: Concept
main entity of page: http://data.bibliotheken.nl/doc/thes/p113078285
main entity of page: https://koninklijkebibliotheek.triply.cc/.well-known/genid/8e27ad14df1ef4e42f3a72aa7a4985a5
editorial note: GOO-thesaurusbeheer houdt zich aanbevolen voor een goede Engelse vertaling
editorial note: Nijhoffs geschiedenislexicon
in scheme: gtt
scope note: Vergaderingen van edelen en hun landsheer