De Strubben
type: Thing
type: Concept
main entity of page: https://data.bibliotheken.nl/.well-known/genid/4ab1c35a8803c275fb568a18f740169c
alternative label: Strubben, De
broader: p075639998
in scheme: brinkman
scope note: De Strubben-Kniphorstbos is een natuurgebied van 377 hectare, gelegen tussen Anloo en Schipborg in de Nederlandse provincie Drenthe