Ambt Delden
type: Thing
type: Concept
main entity of page: https://data.bibliotheken.nl/.well-known/genid/4b283cc2761dd71d0663de4a58d8825f
broader: p075633159
in scheme: brinkman
scope note: Ambt Delden (Nedersakisch: Ambt Dealdn) is een voormalige gemeente in Twente, in de Nederlandse provincie Overijssel