Boekbinders
type: Concept
main entity of page: http://data.bibliotheken.nl/doc/thes/p100628397
main entity of page: https://koninklijkebibliotheek.triply.cc/.well-known/genid/df5934f67d33a796d6ab0dbdc6daa18f
in scheme: gtt
preferred label: Book binders @en
related: p078456401
scope note: Ter aanduiding van hen die het ambacht boekbinden als handwerk beoefenen