Zwammerdam
type: Thing
type: Concept
main entity of page: https://data.bibliotheken.nl/.well-known/genid/c6dcb4299bd867ed3da220a844a91c8a
broader: p075634686
in scheme: brinkman
scope note: Gedeeltelijk opgegaan in de gemeente Alphen aan den Rijn.