Beeld Gods
type: Concept
main entity of page: http://data.bibliotheken.nl/doc/thes/p097039586
main entity of page: https://koninklijkebibliotheek.triply.cc/.well-known/genid/4e63265b13b3ac612c45a6c7d6de2b23
alternative label: Imago Dei
editorial note: Theologisch woordenboek
in scheme: gtt
preferred label: Image of God @en
scope note: Niet te verwarren met: Godsvoorstellingen (=het beeld dat de mens zich vormt van God)