Architectuurgeschiedenis (wetenschap)
type: Concept
main entity of page: https://koninklijkebibliotheek.triply.cc/.well-known/genid/83bc65a70439e5f78d13237cf5a146b1
main entity of page: http://data.bibliotheken.nl/doc/thes/p095967346
broader: p078518830
editorial note: -PV
in scheme: gtt
preferred label: History of architecture (science) @en
scope note: Wordt alleen als aanduiding voor het vakgebied gebruikt. Gebruik voor de geschiedenis van de Architectuur zelf: Bouwkunst + Geschiedenis (vorm) c.q. <periode>