Aumühle
type: Thing
type: Concept
main entity of page: https://data.bibliotheken.nl/.well-known/genid/69143a181b57742809b16a10dc6d1d74
broader: p07567470X
in scheme: brinkman
scope note: Aumühle is een gemeente in de Duitse deelstaat Sleeswijk-Holstein en maakt deel uit van het Amt Hohe Elbgeest in het Kreis Hertogdom Lauenburg