Saba
type: Thing
type: Concept
main entity of page: https://data.bibliotheken.nl/.well-known/genid/8885deb9c32836e19727c8f9c69530e9
broader: p075632713
broader: p344762122
in scheme: brinkman
scope note: Saba is een Nederlands eiland in het Caribisch gebied dat sinds 2010 bestuurlijk als openbaar lichaam een bijzondere gemeente vormt