Vietnam
type: Thing
type: Concept
main entity of page: https://data.bibliotheken.nl/.well-known/genid/0a986b8beadea0c1316091a2521c0c8c
alternative label: Viet Nam
in scheme: brinkman
scope note: Vietnam (Vietnamees: Việt Nam), officieel de Socialistische Republiek Vietnam, is een land in Zuidoost-Azië