Naslagwerken (vorm)
type: Concept
main entity of page: http://data.bibliotheken.nl/doc/thes/p088144143
main entity of page: https://koninklijkebibliotheek.triply.cc/.well-known/genid/9dce2a145a456cba43f90fb92dc97db5
alternative label: Referentiewerken (vorm)
alternative label: Repertoria (vorm)
alternative label: Reference (vorm)
alternative label: Vademecums (vorm)
alternative label: Compendia (vorm)
editorial note: De term reference kan ook gebruikt worden voor niet-boekmateriaal cd-rom etc
in scheme: gtt
preferred label: Reference books (form) @en
scope note: Overkoepelende term die gebruikt wordt voor werken die een combinatie bevatten van adresboek, woordenboek e.d. Gebruik bij voorkeur een specifiekere term.