Adresboeken (vorm)
type: Concept
main entity of page: http://data.bibliotheken.nl/doc/thes/p088141322
main entity of page: https://koninklijkebibliotheek.triply.cc/.well-known/genid/615a7ce96699d954d59c04df2d622bc7
broader: p088144143
in scheme: gtt
preferred label: Directories (form) @en
related: p088144127
scope note: Naslagwerken met alfabetisch of systematisch geordende adresgegevens van instellingen; voor personen wordt Naamlijsten (vorm) gebruikt.