Celebes
type: Thing
type: Concept
main entity of page: https://data.bibliotheken.nl/.well-known/genid/3b1036e3864e8170b72ff695890b3aa7
broader: p075609983
in scheme: brinkman
related: p438410025
scope note: Historische benaming van Sulawesi, een eiland van Indonesië. Gebruik de benaming Celebes tot circa 1945