Kroatië
type: Thing
type: Concept
main entity of page: https://data.bibliotheken.nl/.well-known/genid/321cdcdff8c88bd79aa90e0f6d105bec
in scheme: brinkman
scope note: Kroatië (Kroatisch: Hrvatska), officieel Republiek Kroatië (Republika Hrvatska), is een Zuid-Europees land