Voorgeschiedenis
type: Concept
main entity of page: http://data.bibliotheken.nl/doc/thes/p078949297
main entity of page: https://koninklijkebibliotheek.triply.cc/.well-known/genid/9b18409b8c60ad202ef643a1ed15f4e8
broader: p078518660
in scheme: gtt
preferred label: Previous history @en
related: p078612055
scope note: De periode voorafgaand aan een gebeurtenis (bijv. revolutie)