Tempels
type: Concept
editorial note: -PV
main entity of page: http://data.bibliotheken.nl/doc/thes/p078686709
main entity of page: https://koninklijkebibliotheek.triply.cc/.well-known/genid/83ae4ab9bb4386b1a332448d6756b165
in scheme: gtt
preferred label: Temples @en
related: p078531578
scope note: Zie ook onder de namen van afzonderlijke tempels